Reaction Details
TargetPoly [ADP-ribose] polymerase 1
LigandBDBM50444032
Substrate/Competitorn/a
Meas. Tech.ChEMBL_1278751 (CHEMBL3096298)
IC50 1500±n/a nM
Citation Lindgren, AEKarlberg, TEkblad, TSpjut, SThorsell, AGAndersson, CDNhan, TTHellsten, VWeigelt, JLinusson, ASchüler, HElofsson, M Chemical probes to study ADP-ribosylation: synthesis and biochemical evaluation of inhibitors of the human ADP-ribosyltransferase ARTD3/PARP3. J Med Chem56:9556-68 (2014) 
 
Poly [ADP-ribose] polymerase 1
Name:Poly [ADP-ribose] polymerase 1
Type:n/a
Mol. Mass.:113114.22
Organism:Homo sapiens (Human)
Description:P09874
Residue:1014
BDBM50444032
NameBDBM50444032
Synonyms:CHEMBL3092517
TypeSmall organic molecule
Emp. Form.C19H20N4O4S
Mol. Mass.400.451
SMILESCC(NC(=O)CCc1nc2ccccc2c(=O)[nH]1)c1ccc(cc1)S(N)(=O)=O