Reaction Details
TargetPoly [ADP-ribose] polymerase 1
LigandBDBM103555
Substrate/Competitorn/a
Meas. Tech.ChEMBL_1278751 (CHEMBL3096298)
IC50 880±n/a nM
Citation Lindgren, AEKarlberg, TEkblad, TSpjut, SThorsell, AGAndersson, CDNhan, TTHellsten, VWeigelt, JLinusson, ASchüler, HElofsson, M Chemical probes to study ADP-ribosylation: synthesis and biochemical evaluation of inhibitors of the human ADP-ribosyltransferase ARTD3/PARP3. J Med Chem56:9556-68 (2014) 
 
Poly [ADP-ribose] polymerase 1
Name:Poly [ADP-ribose] polymerase 1
Type:n/a
Mol. Mass.:113114.22
Organism:Homo sapiens (Human)
Description:P09874
Residue:1014
BDBM103555
NameBDBM103555
Synonyms:ME0354
TypeSmall organic molecule
Emp. Form.C18H18N4O2
Mol. Mass.322.3611
SMILESC[C@@H](NC(=O)CCc1nc2ccccc2c(=O)[nH]1)c1ccccn1