Reaction Details
TargetProtein mono-ADP-ribosyltransferase PARP3 [R100H]
LigandBDBM50444035
Substrate/Competitorn/a
Meas. Tech.ChEMBL_1278752 (CHEMBL3096299)
IC50>100000±n/a nM
Citation Lindgren, AEKarlberg, TEkblad, TSpjut, SThorsell, AGAndersson, CDNhan, TTHellsten, VWeigelt, JLinusson, ASchüler, HElofsson, M Chemical probes to study ADP-ribosylation: synthesis and biochemical evaluation of inhibitors of the human ADP-ribosyltransferase ARTD3/PARP3. J Med Chem56:9556-68 (2014) 
 
Protein mono-ADP-ribosyltransferase PARP3 [R100H]
Name:Protein mono-ADP-ribosyltransferase PARP3 [R100H]
Type:PROTEIN
Mol. Mass.:60071.85
Organism:Homo sapiens (Human)
Description:Q9Y6F1[R100H]
Residue:533
BDBM50444035
NameBDBM50444035
Synonyms:CHEMBL3092541
TypeSmall organic molecule
Emp. Form.C20H19N3O2
Mol. Mass.333.3838
SMILESO=C(CCc1nc2ccccc2c(=O)[nH]1)N[C@H]1CCc2ccccc12