Reaction Details
TargetD(2) dopamine receptor
LigandBDBM50444039
Substrate/Competitorn/a
Meas. Tech.ChEMBL_1279266 (CHEMBL3095674)
Ki>1000±n/a nM
Citation Moritomo, AYamada, HWatanabe, TItahana, HAkuzawa, SOkada, MOhta, M Synthesis and structure-activity relationships of new carbonyl guanidine derivatives as novel dual 5-HT2B and 5-HT7 receptor antagonists. Bioorg Med Chem21:7841-52 (2013) 
 
D(2) dopamine receptor
Name:D(2) dopamine receptor
Type:Cell-surface receptors
Mol. Mass.:50647.10
Organism:Homo sapiens (Human)
Description:P14416
Residue:443
BDBM50444039
NameBDBM50444039
Synonyms:CHEMBL3092759
TypeSmall organic molecule
Emp. Form.C15H13N3O2
Mol. Mass.267.2826
SMILESNC(=N)NC(=O)c1ccc-2c(c1)C(O)c1ccccc-21