Reaction Details
TargetD(2) dopamine receptor
LigandBDBM82088
Substrate/Competitorn/a
Meas. Tech.ChEMBL_1279266 (CHEMBL3095674)
Ki 2.4±n/a nM
Citation Moritomo, AYamada, HWatanabe, TItahana, HAkuzawa, SOkada, MOhta, M Synthesis and structure-activity relationships of new carbonyl guanidine derivatives as novel dual 5-HT2B and 5-HT7 receptor antagonists. Bioorg Med Chem21:7841-52 (2013) 
 
D(2) dopamine receptor
Name:D(2) dopamine receptor
Type:Cell-surface receptors
Mol. Mass.:50647.10
Organism:Homo sapiens (Human)
Description:P14416
Residue:443
BDBM82088
NameBDBM82088
Synonyms:CAS_15574-96-6 PIZOTIFEN
TypeSmall organic molecule
Emp. Form.C19H21NS
Mol. Mass.295.442
SMILES[#6]-[#7]-1-[#6]-[#6]\[#6](-[#6]-[#6]-1)=[#6]-1/c2ccsc2-[#6]-[#6]-c2ccccc-12