Reaction Details
TargetGlucocorticoid receptor
LigandBDBM50444186
Substrate/Competitorn/a
Meas. Tech.ChEMBL_1277677 (CHEMBL3096919)
IC50 18±n/a nM
Citation Kuzmich, DBentzien, JBetageri, RDiSalvo, DFadra-Khan, THarcken, CKukulka, ANabozny, GNelson, RPack, ESouza, DThomson, D Function-regulating pharmacophores in a sulfonamide class of glucocorticoid receptor agonists. Bioorg Med Chem Lett23:6640-4 (2013) 
 
Glucocorticoid receptor
Name:Glucocorticoid receptor
Type:Enzyme
Mol. Mass.:85656.87
Organism:Homo sapiens (Human)
Description:P04150
Residue:777
BDBM50444186
NameBDBM50444186
Synonyms:CHEMBL3093445
TypeSmall organic molecule
Emp. Form.C21H23F3N2O2S
Mol. Mass.424.48
SMILESCc1cc(C)c(c(C)c1)S(=O)(=O)NC(Cc1c[nH]c2cccc(C)c12)C(F)(F)F