Reaction Details
TargetMineralocorticoid receptor
LigandBDBM50444187
Substrate/Competitorn/a
Meas. Tech.ChEMBL_1277675 (CHEMBL3096917)
IC50 510±n/a nM
Citation Kuzmich, DBentzien, JBetageri, RDiSalvo, DFadra-Khan, THarcken, CKukulka, ANabozny, GNelson, RPack, ESouza, DThomson, D Function-regulating pharmacophores in a sulfonamide class of glucocorticoid receptor agonists. Bioorg Med Chem Lett23:6640-4 (2013) 
 
Mineralocorticoid receptor
Name:Mineralocorticoid receptor
Type:Enzyme
Mol. Mass.:107076.42
Organism:Homo sapiens (Human)
Description:P08235
Residue:984
BDBM50444187
NameBDBM50444187
Synonyms:CHEMBL3093461
TypeSmall organic molecule
Emp. Form.C18H19Cl2N3O2S
Mol. Mass.412.333
SMILESCC[C@@H](Cn1ccc2ccccc12)NS(=O)(=O)c1c(N)cc(Cl)cc1Cl