Reaction Details
TargetMineralocorticoid receptor
LigandBDBM50444204
Substrate/Competitorn/a
Meas. Tech.ChEMBL_1277675 (CHEMBL3096917)
IC50 260±n/a nM
Citation Kuzmich, DBentzien, JBetageri, RDiSalvo, DFadra-Khan, THarcken, CKukulka, ANabozny, GNelson, RPack, ESouza, DThomson, D Function-regulating pharmacophores in a sulfonamide class of glucocorticoid receptor agonists. Bioorg Med Chem Lett23:6640-4 (2013) 
 
Mineralocorticoid receptor
Name:Mineralocorticoid receptor
Type:Enzyme
Mol. Mass.:107076.42
Organism:Homo sapiens (Human)
Description:P08235
Residue:984
BDBM50444204
NameBDBM50444204
Synonyms:CHEMBL3093462
TypeSmall organic molecule
Emp. Form.C19H21Cl2N3O2S
Mol. Mass.426.36
SMILESCC[C@@H](Cn1cc(C)c2ccccc12)NS(=O)(=O)c1c(N)cc(Cl)cc1Cl