Reaction Details
TargetMineralocorticoid receptor
LigandBDBM50444189
Substrate/Competitorn/a
Meas. Tech.ChEMBL_1277675 (CHEMBL3096917)
IC50 220±n/a nM
Citation Kuzmich, DBentzien, JBetageri, RDiSalvo, DFadra-Khan, THarcken, CKukulka, ANabozny, GNelson, RPack, ESouza, DThomson, D Function-regulating pharmacophores in a sulfonamide class of glucocorticoid receptor agonists. Bioorg Med Chem Lett23:6640-4 (2013) 
 
Mineralocorticoid receptor
Name:Mineralocorticoid receptor
Type:Enzyme
Mol. Mass.:107076.42
Organism:Homo sapiens (Human)
Description:P08235
Residue:984
BDBM50444189
NameBDBM50444189
Synonyms:CHEMBL3093455
TypeSmall organic molecule
Emp. Form.C19H20F3N3O2S
Mol. Mass.411.441
SMILESCc1cc(C)c(c(C)c1)S(=O)(=O)NC(Cn1ccc2ncccc12)C(F)(F)F