Reaction Details
TargetGlucocorticoid receptor
LigandBDBM50444199
Substrate/Competitorn/a
Meas. Tech.ChEMBL_1277677 (CHEMBL3096919)
IC50 210±n/a nM
Citation Kuzmich, DBentzien, JBetageri, RDiSalvo, DFadra-Khan, THarcken, CKukulka, ANabozny, GNelson, RPack, ESouza, DThomson, D Function-regulating pharmacophores in a sulfonamide class of glucocorticoid receptor agonists. Bioorg Med Chem Lett23:6640-4 (2013) 
 
Glucocorticoid receptor
Name:Glucocorticoid receptor
Type:Enzyme
Mol. Mass.:85656.87
Organism:Homo sapiens (Human)
Description:P04150
Residue:777
BDBM50444199
NameBDBM50444199
Synonyms:CHEMBL3093459
TypeSmall organic molecule
Emp. Form.C18H20F3NO3S
Mol. Mass.387.417
SMILESCc1cc(C)c(c(C)c1)S(=O)(=O)NC(COc1ccccc1)C(F)(F)F