Reaction Details
TargetMineralocorticoid receptor
LigandBDBM50444190
Substrate/Competitorn/a
Meas. Tech.ChEMBL_1277675 (CHEMBL3096917)
IC50 140±n/a nM
Citation Kuzmich, DBentzien, JBetageri, RDiSalvo, DFadra-Khan, THarcken, CKukulka, ANabozny, GNelson, RPack, ESouza, DThomson, D Function-regulating pharmacophores in a sulfonamide class of glucocorticoid receptor agonists. Bioorg Med Chem Lett23:6640-4 (2013) 
 
Mineralocorticoid receptor
Name:Mineralocorticoid receptor
Type:Enzyme
Mol. Mass.:107076.42
Organism:Homo sapiens (Human)
Description:P08235
Residue:984
BDBM50444190
NameBDBM50444190
Synonyms:CHEMBL3093447
TypeSmall organic molecule
Emp. Form.C21H23F3N2O2S
Mol. Mass.424.48
SMILESCc1ccc2c(CC(NS(=O)(=O)c3c(C)cc(C)cc3C)C(F)(F)F)c[nH]c2c1