Reaction Details
TargetMineralocorticoid receptor
LigandBDBM50198973
Substrate/Competitorn/a
Meas. Tech.ChEMBL_1277675 (CHEMBL3096917)
IC50 130±n/a nM
Citation Kuzmich, DBentzien, JBetageri, RDiSalvo, DFadra-Khan, THarcken, CKukulka, ANabozny, GNelson, RPack, ESouza, DThomson, D Function-regulating pharmacophores in a sulfonamide class of glucocorticoid receptor agonists. Bioorg Med Chem Lett23:6640-4 (2013) 
 
Mineralocorticoid receptor
Name:Mineralocorticoid receptor
Type:Enzyme
Mol. Mass.:107076.42
Organism:Homo sapiens (Human)
Description:P08235
Residue:984
BDBM50198973
NameBDBM50198973
Synonyms:CHEMBL396029 | N-(1-(1H-indol-3-yl)propan-2-yl)-2,4,6-trichlorobenzenesulfonamide
TypeSmall organic molecule
Emp. Form.C17H15Cl3N2O2S
Mol. Mass.417.737
SMILESCC(Cc1c[nH]c2ccccc12)NS(=O)(=O)c1c(Cl)cc(Cl)cc1Cl