Reaction Details
TargetGlucocorticoid receptor
LigandBDBM50444201
Substrate/Competitorn/a
Meas. Tech.ChEMBL_1277677 (CHEMBL3096919)
IC50 60±n/a nM
Citation Kuzmich, DBentzien, JBetageri, RDiSalvo, DFadra-Khan, THarcken, CKukulka, ANabozny, GNelson, RPack, ESouza, DThomson, D Function-regulating pharmacophores in a sulfonamide class of glucocorticoid receptor agonists. Bioorg Med Chem Lett23:6640-4 (2013) 
 
Glucocorticoid receptor
Name:Glucocorticoid receptor
Type:Enzyme
Mol. Mass.:85656.87
Organism:Homo sapiens (Human)
Description:P04150
Residue:777
BDBM50444201
NameBDBM50444201
Synonyms:CHEMBL3093457
TypeSmall organic molecule
Emp. Form.C21H20F3N3O2S
Mol. Mass.435.463
SMILESCc1cc(C)c(c(C)c1)S(=O)(=O)NC(Cn1ccc2c(cccc12)C#N)C(F)(F)F