Reaction Details
TargetGlucocorticoid receptor
LigandBDBM50444205
Substrate/Competitorn/a
Meas. Tech.ChEMBL_1277674 (CHEMBL3096916)
IC50 7.0±n/a nM
Citation Kuzmich, DBentzien, JBetageri, RDiSalvo, DFadra-Khan, THarcken, CKukulka, ANabozny, GNelson, RPack, ESouza, DThomson, D Function-regulating pharmacophores in a sulfonamide class of glucocorticoid receptor agonists. Bioorg Med Chem Lett23:6640-4 (2013) 
 
Glucocorticoid receptor
Name:Glucocorticoid receptor
Type:Enzyme
Mol. Mass.:85656.87
Organism:Homo sapiens (Human)
Description:P04150
Residue:777
BDBM50444205
NameBDBM50444205
Synonyms:CHEMBL3093463
TypeSmall organic molecule
Emp. Form.C19H18Cl2N4O2S
Mol. Mass.437.343
SMILESCC[C@@H](Cn1cc(C#N)c2ccccc12)NS(=O)(=O)c1c(N)cc(Cl)cc1Cl