Reaction Details
TargetKallikrein-1
LigandBDBM50444296
Substrate/Competitorn/a
Meas. Tech.ChEMBL_1278120 (CHEMBL3095808)
IC50>50000±n/a nM
Citation Lucas, SDGonçalves, LMCarvalho, LACorreia, HFDa Costa, EMGuedes, RAMoreira, RGuedes, RC Optimization of O3-acyl kojic acid derivatives as potent and selective human neutrophil elastase inhibitors. J Med Chem56:9802-6 (2014) 
 
Kallikrein-1
Name:Kallikrein-1
Type:Enzyme
Mol. Mass.:28874.69
Organism:Homo sapiens (Human)
Description:P06870
Residue:262
BDBM50444296
NameBDBM50444296
Synonyms:CHEMBL3093814
TypeSmall organic molecule
Emp. Form.C19H17NO7S
Mol. Mass.403.406
SMILESCC(C)(C)C(=O)Oc1coc(CSc2nc3cc(ccc3o2)C(O)=O)cc1=O