Reaction Details
TargetCathepsin G
LigandBDBM50444295
Substrate/Competitorn/a
Meas. Tech.ChEMBL_1278124 (CHEMBL3095812)
IC50 19000±n/a nM
Citation Lucas, SDGonçalves, LMCarvalho, LACorreia, HFDa Costa, EMGuedes, RAMoreira, RGuedes, RC Optimization of O3-acyl kojic acid derivatives as potent and selective human neutrophil elastase inhibitors. J Med Chem56:9802-6 (2014) 
 
Cathepsin G
Name:Cathepsin G
Type:PROTEIN
Mol. Mass.:28860.08
Organism:Homo sapiens (Human)
Description:ChEMBL_1469016
Residue:255
BDBM50444295
NameBDBM50444295
Synonyms:CHEMBL3093806
TypeSmall organic molecule
Emp. Form.C25H22N2O6S
Mol. Mass.478.517
SMILESCC(C)(C)C(=O)Oc1cn(c(CSc2nc3cc(ccc3o2)C(O)=O)cc1=O)-c1ccccc1