Reaction Details
TargetCathepsin G
LigandBDBM50444297
Substrate/Competitorn/a
Meas. Tech.ChEMBL_1278124 (CHEMBL3095812)
IC50>100000±n/a nM
Citation Lucas, SDGonçalves, LMCarvalho, LACorreia, HFDa Costa, EMGuedes, RAMoreira, RGuedes, RC Optimization of O3-acyl kojic acid derivatives as potent and selective human neutrophil elastase inhibitors. J Med Chem56:9802-6 (2014) 
 
Cathepsin G
Name:Cathepsin G
Type:PROTEIN
Mol. Mass.:28860.08
Organism:Homo sapiens (Human)
Description:ChEMBL_1469016
Residue:255
BDBM50444297
NameBDBM50444297
Synonyms:CHEMBL3093815
TypeSmall organic molecule
Emp. Form.C18H17NO4S2
Mol. Mass.375.462
SMILESCC(C)(C)C(=O)Oc1coc(CSc2nc3ccccc3s2)cc1=O