Reaction Details
TargetCathepsin S
LigandBDBM50444313
Substrate/Competitorn/a
Meas. Tech.ChEMBL_1278248 (CHEMBL3096507)
IC50 2.0±n/a nM
Citation Hilpert, HMauser, HHumm, RAnselm, LKuehne, HHartmann, GGruener, SBanner, DWBenz, JGsell, BKuglstatter, AStihle, MThoma, RSanchez, RAIding, HWirz, BHaap, W Identification of potent and selective cathepsin S inhibitors containing different central cyclic scaffolds. J Med Chem56:9789-801 (2014) 
 
Cathepsin S
Name:Cathepsin S
Type:Enzyme
Mol. Mass.:38476.67
Organism:Mus musculus (Mouse)
Description:O70370
Residue:340
BDBM50444313
NameBDBM50444313
Synonyms:CHEMBL3093936
TypeSmall organic molecule
Emp. Form.C17H18ClN3O4S
Mol. Mass.395.861
SMILESCC(=O)N1C[C@@H](C[C@H]1C(=O)NC1(CC1)C#N)S(=O)(=O)c1ccccc1Cl