Reaction Details
TargetPoly [ADP-ribose] polymerase tankyrase-1
LigandBDBM50444542
Substrate/Competitorn/a
Meas. Tech.ChEMBL_1281549 (CHEMBL3102115)
IC50 44±n/a nM
Citation Nathubhai, AWood, PJLloyd, MDThompson, ASThreadgill, MD Design and Discovery of 2-Arylquinazolin-4-ones as Potent and Selective Inhibitors of Tankyrases. ACS Med Chem Lett4:1173-7 (2013) 
 
Poly [ADP-ribose] polymerase tankyrase-1
Name:Poly [ADP-ribose] polymerase tankyrase-1
Type:Enzyme
Mol. Mass.:142058.03
Organism:Homo sapiens (Human)
Description:O95271
Residue:1327
BDBM50444542
NameBDBM50444542
Synonyms:CHEMBL3098938
TypeSmall organic molecule
Emp. Form.C15H11FN2O
Mol. Mass.254.259
SMILESCc1cccc2c1nc([nH]c2=O)-c1ccc(F)cc1