Reaction Details
TargetPoly [ADP-ribose] polymerase tankyrase-1
LigandBDBM50444543
Substrate/Competitorn/a
Meas. Tech.ChEMBL_1281549 (CHEMBL3102115)
IC50 32±n/a nM
Citation Nathubhai, AWood, PJLloyd, MDThompson, ASThreadgill, MD Design and Discovery of 2-Arylquinazolin-4-ones as Potent and Selective Inhibitors of Tankyrases. ACS Med Chem Lett4:1173-7 (2013) 
 
Poly [ADP-ribose] polymerase tankyrase-1
Name:Poly [ADP-ribose] polymerase tankyrase-1
Type:Enzyme
Mol. Mass.:142058.03
Organism:Homo sapiens (Human)
Description:O95271
Residue:1327
BDBM50444543
NameBDBM50444543
Synonyms:CHEMBL3098937
TypeSmall organic molecule
Emp. Form.C15H11BrN2O
Mol. Mass.315.165
SMILESCc1cccc2c1nc([nH]c2=O)-c1ccc(Br)cc1