Reaction Details
TargetPoly [ADP-ribose] polymerase tankyrase-1
LigandBDBM50444545
Substrate/Competitorn/a
Meas. Tech.ChEMBL_1281549 (CHEMBL3102115)
IC50 35±n/a nM
Citation Nathubhai, AWood, PJLloyd, MDThompson, ASThreadgill, MD Design and Discovery of 2-Arylquinazolin-4-ones as Potent and Selective Inhibitors of Tankyrases. ACS Med Chem Lett4:1173-7 (2013) 
 
Poly [ADP-ribose] polymerase tankyrase-1
Name:Poly [ADP-ribose] polymerase tankyrase-1
Type:Enzyme
Mol. Mass.:142058.03
Organism:Homo sapiens (Human)
Description:O95271
Residue:1327
BDBM50444545
NameBDBM50444545
Synonyms:CHEMBL3098940
TypeSmall organic molecule
Emp. Form.C16H14N2O
Mol. Mass.250.2952
SMILESCc1ccc(cc1)-c1nc2c(C)cccc2c(=O)[nH]1