Reaction Details
TargetPoly [ADP-ribose] polymerase tankyrase-1
LigandBDBM50068766
Substrate/Competitorn/a
Meas. Tech.ChEMBL_1281549 (CHEMBL3102115)
IC50 35±n/a nM
Citation Nathubhai, AWood, PJLloyd, MDThompson, ASThreadgill, MD Design and Discovery of 2-Arylquinazolin-4-ones as Potent and Selective Inhibitors of Tankyrases. ACS Med Chem Lett4:1173-7 (2013) 
 
Poly [ADP-ribose] polymerase tankyrase-1
Name:Poly [ADP-ribose] polymerase tankyrase-1
Type:Enzyme
Mol. Mass.:142058.03
Organism:Homo sapiens (Human)
Description:O95271
Residue:1327
BDBM50068766
NameBDBM50068766
Synonyms:2-(4-Amino-phenyl)-8-methyl-3H-quinazolin-4-one | CHEMBL541203
TypeSmall organic molecule
Emp. Form.C15H13N3O
Mol. Mass.251.2832
SMILESCc1cccc2c1nc([nH]c2=O)-c1ccc(N)cc1