Reaction Details
TargetPoly [ADP-ribose] polymerase tankyrase-2
LigandBDBM50068755
Substrate/Competitorn/a
Meas. Tech.ChEMBL_1281548 (CHEMBL3102114)
IC50 3±n/a nM
Citation Nathubhai, AWood, PJLloyd, MDThompson, ASThreadgill, MD Design and Discovery of 2-Arylquinazolin-4-ones as Potent and Selective Inhibitors of Tankyrases. ACS Med Chem Lett4:1173-7 (2013) 
 
Poly [ADP-ribose] polymerase tankyrase-2
Name:Poly [ADP-ribose] polymerase tankyrase-2
Type:Enzyme
Mol. Mass.:126937.16
Organism:Homo sapiens (Human)
Description:Q9H2K2
Residue:1166
BDBM50068755
NameBDBM50068755
Synonyms:2-(4-Hydroxy-phenyl)-8-methyl-3H-quinazolin-4-one | CHEMBL125244
TypeSmall organic molecule
Emp. Form.C15H12N2O2
Mol. Mass.252.268
SMILESCc1cccc2c1nc([nH]c2=O)-c1ccc(O)cc1