Reaction Details
TargetPoly [ADP-ribose] polymerase tankyrase-1
LigandBDBM50068765
Substrate/Competitorn/a
Meas. Tech.ChEMBL_1281549 (CHEMBL3102115)
IC50 48±n/a nM
Citation Nathubhai, AWood, PJLloyd, MDThompson, ASThreadgill, MD Design and Discovery of 2-Arylquinazolin-4-ones as Potent and Selective Inhibitors of Tankyrases. ACS Med Chem Lett4:1173-7 (2013) 
 
Poly [ADP-ribose] polymerase tankyrase-1
Name:Poly [ADP-ribose] polymerase tankyrase-1
Type:Enzyme
Mol. Mass.:142058.03
Organism:Homo sapiens (Human)
Description:O95271
Residue:1327
BDBM50068765
NameBDBM50068765
Synonyms:8-Methyl-2-(4-trifluoromethyl-phenyl)-3H-quinazolin-4-one | CHEMBL346886
TypeSmall organic molecule
Emp. Form.C16H11F3N2O
Mol. Mass.304.2665
SMILESCc1cccc2c1nc([nH]c2=O)-c1ccc(cc1)C(F)(F)F