Reaction Details
TargetInosine-5'-monophosphate dehydrogenase 2
LigandBDBM50318567
Substrate/Competitorn/a
Meas. Tech.ChEMBL_1281546 (CHEMBL3102112)
IC50>10000±n/a nM
Citation Nathubhai, AWood, PJLloyd, MDThompson, ASThreadgill, MD Design and Discovery of 2-Arylquinazolin-4-ones as Potent and Selective Inhibitors of Tankyrases. ACS Med Chem Lett4:1173-7 (2013) 
 
Inosine-5'-monophosphate dehydrogenase 2
Name:Inosine-5'-monophosphate dehydrogenase 2
Type:Enzyme
Mol. Mass.:55806.87
Organism:Homo sapiens (Human)
Description:Recombinant IMPDH2 expressed in E. coli.
Residue:514
BDBM50318567
NameBDBM50318567
Synonyms:2-(4-(Trifluoromethyl)phenyl)-7,8-dihydro-5H-thiopyrano-[4,3-d]pyrimidin-4-ol CHEMBL1086580
TypeSmall organic molecule
Emp. Form.C14H11F3N2OS
Mol. Mass.312.31
SMILESFC(F)(F)c1ccc(cc1)-c1nc2CCSCc2c(=O)[nH]1