Reaction Details
TargetInosine-5'-monophosphate dehydrogenase 2
LigandBDBM50444545
Substrate/Competitorn/a
Meas. Tech.ChEMBL_1281546 (CHEMBL3102112)
IC50>10000±n/a nM
Citation Nathubhai, AWood, PJLloyd, MDThompson, ASThreadgill, MD Design and Discovery of 2-Arylquinazolin-4-ones as Potent and Selective Inhibitors of Tankyrases. ACS Med Chem Lett4:1173-7 (2013) 
 
Inosine-5'-monophosphate dehydrogenase 2
Name:Inosine-5'-monophosphate dehydrogenase 2
Type:Enzyme
Mol. Mass.:55806.87
Organism:Homo sapiens (Human)
Description:Recombinant IMPDH2 expressed in E. coli.
Residue:514
BDBM50444545
NameBDBM50444545
Synonyms:CHEMBL3098940
TypeSmall organic molecule
Emp. Form.C16H14N2O
Mol. Mass.250.2952
SMILESCc1ccc(cc1)-c1nc2c(C)cccc2c(=O)[nH]1