Reaction Details
TargetInosine-5'-monophosphate dehydrogenase 2
LigandBDBM50068765
Substrate/Competitorn/a
Meas. Tech.ChEMBL_1281546 (CHEMBL3102112)
IC50>10000±n/a nM
Citation Nathubhai, AWood, PJLloyd, MDThompson, ASThreadgill, MD Design and Discovery of 2-Arylquinazolin-4-ones as Potent and Selective Inhibitors of Tankyrases. ACS Med Chem Lett4:1173-7 (2013) 
 
Inosine-5'-monophosphate dehydrogenase 2
Name:Inosine-5'-monophosphate dehydrogenase 2
Type:Enzyme
Mol. Mass.:55806.87
Organism:Homo sapiens (Human)
Description:Recombinant IMPDH2 expressed in E. coli.
Residue:514
BDBM50068765
NameBDBM50068765
Synonyms:8-Methyl-2-(4-trifluoromethyl-phenyl)-3H-quinazolin-4-one | CHEMBL346886
TypeSmall organic molecule
Emp. Form.C16H11F3N2O
Mol. Mass.304.2665
SMILESCc1cccc2c1nc([nH]c2=O)-c1ccc(cc1)C(F)(F)F