Reaction Details
TargetPoly [ADP-ribose] polymerase 1
LigandBDBM50444541
Substrate/Competitorn/a
Meas. Tech.ChEMBL_1281547 (CHEMBL3102113)
IC50>5000±n/a nM
Citation Nathubhai, AWood, PJLloyd, MDThompson, ASThreadgill, MD Design and Discovery of 2-Arylquinazolin-4-ones as Potent and Selective Inhibitors of Tankyrases. ACS Med Chem Lett4:1173-7 (2013) 
 
Poly [ADP-ribose] polymerase 1
Name:Poly [ADP-ribose] polymerase 1
Type:n/a
Mol. Mass.:113114.22
Organism:Homo sapiens (Human)
Description:P09874
Residue:1014
BDBM50444541
NameBDBM50444541
Synonyms:CHEMBL3098935
TypeSmall organic molecule
Emp. Form.C24H21N3O3
Mol. Mass.399.4418
SMILESCc1cccc2c1nc([nH]c2=O)-c1ccc(CNC(=O)OCc2ccccc2)cc1