Reaction Details
TargetPoly [ADP-ribose] polymerase 1
LigandBDBM50068755
Substrate/Competitorn/a
Meas. Tech.ChEMBL_1281547 (CHEMBL3102113)
IC50 1200±n/a nM
Citation Nathubhai, AWood, PJLloyd, MDThompson, ASThreadgill, MD Design and Discovery of 2-Arylquinazolin-4-ones as Potent and Selective Inhibitors of Tankyrases. ACS Med Chem Lett4:1173-7 (2013) 
 
Poly [ADP-ribose] polymerase 1
Name:Poly [ADP-ribose] polymerase 1
Type:n/a
Mol. Mass.:113114.22
Organism:Homo sapiens (Human)
Description:P09874
Residue:1014
BDBM50068755
NameBDBM50068755
Synonyms:2-(4-Hydroxy-phenyl)-8-methyl-3H-quinazolin-4-one | CHEMBL125244
TypeSmall organic molecule
Emp. Form.C15H12N2O2
Mol. Mass.252.268
SMILESCc1cccc2c1nc([nH]c2=O)-c1ccc(O)cc1