Reaction Details
TargetPoly [ADP-ribose] polymerase 1
LigandBDBM50068762
Substrate/Competitorn/a
Meas. Tech.ChEMBL_1281547 (CHEMBL3102113)
IC50 891±n/a nM
Citation Nathubhai, AWood, PJLloyd, MDThompson, ASThreadgill, MD Design and Discovery of 2-Arylquinazolin-4-ones as Potent and Selective Inhibitors of Tankyrases. ACS Med Chem Lett4:1173-7 (2013) 
 
Poly [ADP-ribose] polymerase 1
Name:Poly [ADP-ribose] polymerase 1
Type:n/a
Mol. Mass.:113114.22
Organism:Homo sapiens (Human)
Description:P09874
Residue:1014
BDBM50068762
NameBDBM50068762
Synonyms:2-(4-Methoxy-phenyl)-8-methyl-3H-quinazolin-4-one | CHEMBL127101
TypeSmall organic molecule
Emp. Form.C16H14N2O2
Mol. Mass.266.2946
SMILESCOc1ccc(cc1)-c1nc2c(C)cccc2c(=O)[nH]1