Reaction Details
TargetPoly [ADP-ribose] polymerase 1
LigandBDBM50068752
Substrate/Competitorn/a
Meas. Tech.ChEMBL_1281547 (CHEMBL3102113)
IC50 104±n/a nM
Citation Nathubhai, AWood, PJLloyd, MDThompson, ASThreadgill, MD Design and Discovery of 2-Arylquinazolin-4-ones as Potent and Selective Inhibitors of Tankyrases. ACS Med Chem Lett4:1173-7 (2013) 
 
Poly [ADP-ribose] polymerase 1
Name:Poly [ADP-ribose] polymerase 1
Type:n/a
Mol. Mass.:113114.22
Organism:Homo sapiens (Human)
Description:P09874
Residue:1014
BDBM50068752
NameBDBM50068752
Synonyms:8-Methyl-2-(4-nitro-phenyl)-3H-quinazolin-4-one | CHEMBL127396
TypeSmall organic molecule
Emp. Form.C15H11N3O3
Mol. Mass.281.2661
SMILESCc1cccc2c1nc([nH]c2=O)-c1ccc(cc1)[N+]([O-])=O