Reaction Details
TargetDelta carbonic anhydrase
LigandBDBM10871
Substrate/Competitorn/a
Meas. Tech.ChEMBL_1282543 (CHEMBL3101210)
Ki 897±n/a nM
Citation Vullo, DDel Prete, SOsman, SMDe Luca, VScozzafava, AAlothman, ZSupuran, CTCapasso, C Sulfonamide inhibition studies of thed-carbonic anhydrase from the diatom Thalassiosira weissflogii. Bioorg Med Chem Lett24:275-9 (2013) 
 
Delta carbonic anhydrase
Name:Delta carbonic anhydrase
Synonyms:ca1
Type:PROTEIN
Mol. Mass.:32261.40
Organism:Thalassiosira weissflogii
Description:ChEMBL_107983
Residue:281
BDBM10871
NameBDBM10871
TypeSmall organic molecule
Emp. Form.C13H15N3O4S2
Mol. Mass.341.406
SMILESNc1ccc(cc1)S(=O)(=O)NCc1ccc(cc1)S(N)(=O)=O