Reaction Details
TargetTransporter
LigandBDBM50444863
Substrate/Competitorn/a
Meas. Tech.ChEMBL_1282844 (CHEMBL3102345)
Ki 739±n/a nM
Citation Sharma, HSantra, SDebnath, JAntonio, TReith, MDutta, A Flexible and biomimetic analogs of triple uptake inhibitor 4-((((3S,6S)-6-benzhydryltetrahydro-2H-pyran-3-yl)amino)methyl)phenol: Synthesis, biological characterization, and development of a pharmacophore model. Bioorg Med Chem22:311-24 (2013) 
 
Transporter
Name:Transporter
Type:Multi-pass membrane protein
Mol. Mass.:69236.90
Organism:Rattus norvegicus (rat)
Description:Q63380
Residue:617
BDBM50444863
NameBDBM50444863
Synonyms:CHEMBL3099492
TypeSmall organic molecule
Emp. Form.C25H27NO
Mol. Mass.357.488
SMILESC(Cc1ccccc1)N[C@H]1CO[C@@H](C1)C(c1ccccc1)c1ccccc1