Reaction Details
TargetTransporter
LigandBDBM50444870
Substrate/Competitorn/a
Meas. Tech.ChEMBL_1282844 (CHEMBL3102345)
Ki 240±n/a nM
Citation Sharma, HSantra, SDebnath, JAntonio, TReith, MDutta, A Flexible and biomimetic analogs of triple uptake inhibitor 4-((((3S,6S)-6-benzhydryltetrahydro-2H-pyran-3-yl)amino)methyl)phenol: Synthesis, biological characterization, and development of a pharmacophore model. Bioorg Med Chem22:311-24 (2013) 
 
Transporter
Name:Transporter
Type:Multi-pass membrane protein
Mol. Mass.:69236.90
Organism:Rattus norvegicus (rat)
Description:Q63380
Residue:617
BDBM50444870
NameBDBM50444870
Synonyms:CHEMBL3099485
TypeSmall organic molecule
Emp. Form.C19H23NO2
Mol. Mass.297.3914
SMILESOc1ccc(CN[C@H]2CC[C@@H](Cc3ccccc3)OC2)cc1