Reaction Details
TargetC-C chemokine receptor type 1
LigandBDBM50445002
Substrate/Competitorn/a
Meas. Tech.ChEMBL_1281524 (CHEMBL3102090)
IC50 0.630000±n/a nM
Citation Hossain, NMensonides-Harsema, MCooper, MEEriksson, TIvanova, SBergström, L Structure activity relationships of fused bicyclic and urea derivatives of spirocyclic compounds as potent CCR1 antagonists. Bioorg Med Chem Lett24:108-12 (2013) 
 
C-C chemokine receptor type 1
Name:C-C chemokine receptor type 1
Type:Enzyme
Mol. Mass.:41180.69
Organism:Homo sapiens (Human)
Description:P32246
Residue:355
BDBM50445002
NameBDBM50445002
Synonyms:CHEMBL3099947
TypeSmall organic molecule
Emp. Form.C25H30FN3O5
Mol. Mass.471.5212
SMILESO[C@H](COc1cc(O)ccc1NC(=O)NC1CC1)CN1CCC2(Cc3cc(F)ccc3O2)CC1