Reaction Details
TargetDual specificity tyrosine-phosphorylation-regulated kinase 1A
LigandBDBM50445232
Substrate/Competitorn/a
Meas. Tech.ChEMBL_1284986 (CHEMBL3105976)
IC50 5.5±n/a nM
Citation Gourdain, SDairou, JDenhez, CBui, LCRodrigues-Lima, FJanel, NDelabar, JMCariou, KDodd, RH Development of DANDYs, new 3,5-diaryl-7-azaindoles demonstrating potent DYRK1A kinase inhibitory activity. J Med Chem56:9569-85 (2014) 
 
Dual specificity tyrosine-phosphorylation-regulated kinase 1A
Name:Dual specificity tyrosine-phosphorylation-regulated kinase 1A
Type:Enzyme Catalytic Domain
Mol. Mass.:85573.59
Organism:RAT
Description:Dual-specificity tyrosine-(Y)-phosphorylation regulated kinase 1A 0 RAT::Q63470
Residue:763
BDBM50445232
NameBDBM50445232
Synonyms:CHEMBL3102952
TypeSmall organic molecule
Emp. Form.C19H14N2O3
Mol. Mass.318.3261
SMILESOc1ccc(cc1)-c1c[nH]c2ncc(cc12)-c1ccc(O)c(O)c1