Reaction Details
TargetLysine-specific histone demethylase 1A
LigandBDBM50445333
Substrate/Competitorn/a
Meas. Tech.ChEMBL_1285475 (CHEMBL3108407)
IC50>3000±n/a nM
Citation Sorna, VTheisen, ERStephens, BWarner, SLBearss, DJVankayalapati, HSharma, S High-throughput virtual screening identifies novel N'-(1-phenylethylidene)-benzohydrazides as potent, specific, and reversible LSD1 inhibitors. J Med Chem56:9496-508 (2014) 
 
Lysine-specific histone demethylase 1A
Name:Lysine-specific histone demethylase 1A
Type:Enzyme
Mol. Mass.:92901.01
Organism:Homo sapiens (Human)
Description:O60341
Residue:852
BDBM50445333
NameBDBM50445333
Synonyms:CHEMBL3104248
TypeSmall organic molecule
Emp. Form.C20H25N3O
Mol. Mass.323.432
SMILESCCN(CC)c1cccc(c1)C(=O)NN=C(C)c1cccc(C)c1