Reaction Details
TargetLysine-specific histone demethylase 1A
LigandBDBM50445334
Substrate/Competitorn/a
Meas. Tech.ChEMBL_1285475 (CHEMBL3108407)
IC50>3000±n/a nM
Citation Sorna, VTheisen, ERStephens, BWarner, SLBearss, DJVankayalapati, HSharma, S High-throughput virtual screening identifies novel N'-(1-phenylethylidene)-benzohydrazides as potent, specific, and reversible LSD1 inhibitors. J Med Chem56:9496-508 (2014) 
 
Lysine-specific histone demethylase 1A
Name:Lysine-specific histone demethylase 1A
Type:Enzyme
Mol. Mass.:92901.01
Organism:Homo sapiens (Human)
Description:O60341
Residue:852
BDBM50445334
NameBDBM50445334
Synonyms:CHEMBL3104247 | US9555024, 7
TypeSmall organic molecule
Emp. Form.C18H17ClFN3O5S
Mol. Mass.441.861
SMILESFc1ccc(cc1C(=O)NNC(=O)c1cccc(Cl)c1)S(=O)(=O)N1CCOCC1