Reaction Details
TargetLysine-specific histone demethylase 1A
LigandBDBM50445337
Substrate/Competitorn/a
Meas. Tech.ChEMBL_1285479 (CHEMBL3108411)
IC50 1900±n/a nM
Citation Sorna, VTheisen, ERStephens, BWarner, SLBearss, DJVankayalapati, HSharma, S High-throughput virtual screening identifies novel N'-(1-phenylethylidene)-benzohydrazides as potent, specific, and reversible LSD1 inhibitors. J Med Chem56:9496-508 (2014) 
 
Lysine-specific histone demethylase 1A
Name:Lysine-specific histone demethylase 1A
Type:Enzyme
Mol. Mass.:92901.01
Organism:Homo sapiens (Human)
Description:O60341
Residue:852
BDBM50445337
NameBDBM50445337
Synonyms:CHEMBL3104339
TypeSmall organic molecule
Emp. Form.C26H27N3O4
Mol. Mass.445.5103
SMILESNC1CC1c1ccc(OCCC(NC(=O)c2ccc(O)cc2)C(=O)Nc2ccccc2)cc1