Reaction Details
TargetLysine-specific histone demethylase 1A
LigandBDBM50445341
Substrate/Competitorn/a
Meas. Tech.ChEMBL_1285475 (CHEMBL3108407)
IC50 275±n/a nM
Citation Sorna, VTheisen, ERStephens, BWarner, SLBearss, DJVankayalapati, HSharma, S High-throughput virtual screening identifies novel N'-(1-phenylethylidene)-benzohydrazides as potent, specific, and reversible LSD1 inhibitors. J Med Chem56:9496-508 (2014) 
 
Lysine-specific histone demethylase 1A
Name:Lysine-specific histone demethylase 1A
Type:Enzyme
Mol. Mass.:92901.01
Organism:Homo sapiens (Human)
Description:O60341
Residue:852
BDBM50445341
NameBDBM50445341
Synonyms:CHEMBL3104346 | US9555024, 2
TypeSmall organic molecule
Emp. Form.C14H11ClN2O3
Mol. Mass.290.702
SMILESOc1ccc(cc1)C(=O)N\N=C\c1cc(Cl)ccc1O