Reaction Details
TargetLysine-specific histone demethylase 1A
LigandBDBM50445345
Substrate/Competitorn/a
Meas. Tech.ChEMBL_1285479 (CHEMBL3108411)
IC50 100±n/a nM
Citation Sorna, VTheisen, ERStephens, BWarner, SLBearss, DJVankayalapati, HSharma, S High-throughput virtual screening identifies novel N'-(1-phenylethylidene)-benzohydrazides as potent, specific, and reversible LSD1 inhibitors. J Med Chem56:9496-508 (2014) 
 
Lysine-specific histone demethylase 1A
Name:Lysine-specific histone demethylase 1A
Type:Enzyme
Mol. Mass.:92901.01
Organism:Homo sapiens (Human)
Description:O60341
Residue:852
BDBM50445345
NameBDBM50445345
Synonyms:CHEMBL3104340
TypeSmall organic molecule
Emp. Form.C17H27N3
Mol. Mass.273.4164
SMILESCN(C)[C@@H]1CCN(CCN[C@H]2C[C@@H]2c2ccccc2)C1