Reaction Details
TargetCytochrome P450 1A2
LigandBDBM50445346
Substrate/Competitorn/a
Meas. Tech.ChEMBL_1285469 (CHEMBL3108401)
IC50>10000±n/a nM
Citation Sorna, VTheisen, ERStephens, BWarner, SLBearss, DJVankayalapati, HSharma, S High-throughput virtual screening identifies novel N'-(1-phenylethylidene)-benzohydrazides as potent, specific, and reversible LSD1 inhibitors. J Med Chem56:9496-508 (2014) 
 
Cytochrome P450 1A2
Name:Cytochrome P450 1A2
Type:Enzyme
Mol. Mass.:58423.38
Organism:Homo sapiens (Human)
Description:P05177
Residue:516
BDBM50445346
NameBDBM50445346
Synonyms:CHEMBL3104250
TypeSmall organic molecule
Emp. Form.C19H20ClN3O5S
Mol. Mass.437.897
SMILESCC(=NNC(=O)c1cccc(c1)S(=O)(=O)N1CCOCC1)c1cc(Cl)ccc1O