Reaction Details
TargetLysine-specific histone demethylase 1A
LigandBDBM50445362
Substrate/Competitorn/a
Meas. Tech.ChEMBL_1285475 (CHEMBL3108407)
IC50>3000±n/a nM
Citation Sorna, VTheisen, ERStephens, BWarner, SLBearss, DJVankayalapati, HSharma, S High-throughput virtual screening identifies novel N'-(1-phenylethylidene)-benzohydrazides as potent, specific, and reversible LSD1 inhibitors. J Med Chem56:9496-508 (2014) 
 
Lysine-specific histone demethylase 1A
Name:Lysine-specific histone demethylase 1A
Type:Enzyme
Mol. Mass.:92901.01
Organism:Homo sapiens (Human)
Description:O60341
Residue:852
BDBM50445362
NameBDBM50445362
Synonyms:CHEMBL3104254
TypeSmall organic molecule
Emp. Form.C19H19ClFN3O4S
Mol. Mass.439.888
SMILESCC(=NNC(=O)c1cccc(c1)S(=O)(=O)N1CCOCC1)c1cccc(Cl)c1F