Reaction Details
TargetLysine-specific histone demethylase 1A
LigandBDBM50445363
Substrate/Competitorn/a
Meas. Tech.ChEMBL_1285479 (CHEMBL3108411)
IC50 18000±n/a nM
Citation Sorna, VTheisen, ERStephens, BWarner, SLBearss, DJVankayalapati, HSharma, S High-throughput virtual screening identifies novel N'-(1-phenylethylidene)-benzohydrazides as potent, specific, and reversible LSD1 inhibitors. J Med Chem56:9496-508 (2014) 
 
Lysine-specific histone demethylase 1A
Name:Lysine-specific histone demethylase 1A
Type:Enzyme
Mol. Mass.:92901.01
Organism:Homo sapiens (Human)
Description:O60341
Residue:852
BDBM50445363
NameBDBM50445363
Synonyms:CHEMBL3104341
TypeSmall organic molecule
Emp. Form.C18H18N2
Mol. Mass.262.3489
SMILESC(N[C@@H]1C[C@H]1c1ccccc1)c1c[nH]c2ccccc12