Reaction Details
TargetLysine-specific histone demethylase 1A
LigandBDBM50445366
Substrate/Competitorn/a
Meas. Tech.ChEMBL_1285479 (CHEMBL3108411)
IC50 25±n/a nM
Citation Sorna, VTheisen, ERStephens, BWarner, SLBearss, DJVankayalapati, HSharma, S High-throughput virtual screening identifies novel N'-(1-phenylethylidene)-benzohydrazides as potent, specific, and reversible LSD1 inhibitors. J Med Chem56:9496-508 (2014) 
 
Lysine-specific histone demethylase 1A
Name:Lysine-specific histone demethylase 1A
Type:Enzyme
Mol. Mass.:92901.01
Organism:Homo sapiens (Human)
Description:O60341
Residue:852
BDBM50445366
NameBDBM50445366
Synonyms:CHEMBL3104342
TypeSmall organic molecule
Emp. Form.C23H29N3O2
Mol. Mass.379.4953
SMILESCOc1cccc(c1)-c1ccc(cc1)[C@@H]1C[C@H]1NCC(=O)N1CCN(C)CC1