Reaction Details
TargetUrotensin-2 receptor
LigandBDBM50445379
Substrate/Competitorn/a
Meas. Tech.ChEMBL_1285482 (CHEMBL3108414)
EC50>0.000±n/a nM
Citation Chatenet, DFolch, BFeytens, DLétourneau, MTourwé, DDoucet, NFournier, A Development and pharmacological characterization of conformationally constrained urotensin II-related peptide agonists. J Med Chem56:9612-22 (2014) 
 
Urotensin-2 receptor
Name:Urotensin-2 receptor
Type:Enzyme Catalytic Domain
Mol. Mass.:42725.34
Organism:RAT
Description:Urotensin-II UTS2R RAT::P49684
Residue:386
BDBM50445379
NameBDBM50445379
Synonyms:CHEMBL3104640
TypeSmall organic molecule
Emp. Form.C47H69N9O10S2
Mol. Mass.984.235
SMILESCC(C)[C@H](NC(=O)[C@@H]1CSSC[C@H](NC(=O)[C@H](C)N)C(=O)N[C@@H](Cc2ccccc2)C(=O)N[C@@H](CC2CCCCC2)C(=O)N[C@@H](CCCCN)C(=O)N[C@@H](Cc2ccc(O)cc2)C(=O)N1)C(O)=O