Reaction Details
TargetUrotensin-2 receptor
LigandBDBM50445375
Substrate/Competitorn/a
Meas. Tech.ChEMBL_1285482 (CHEMBL3108414)
EC50>0.000±n/a nM
Comments>0.000001 20220121
Citation Chatenet, DFolch, BFeytens, DLétourneau, MTourwé, DDoucet, NFournier, A Development and pharmacological characterization of conformationally constrained urotensin II-related peptide agonists. J Med Chem56:9612-22 (2014) 
 
Urotensin-2 receptor
Name:Urotensin-2 receptor
Type:Enzyme Catalytic Domain
Mol. Mass.:42725.34
Organism:RAT
Description:Urotensin-II UTS2R RAT::P49684
Residue:386
BDBM50445375
NameBDBM50445375
Synonyms:CHEMBL3104459
TypeSmall organic molecule
Emp. Form.C50H64N10O10S2
Mol. Mass.1029.234
SMILESCC(C)[C@H](NC(=O)[C@@H]1CSSC[C@H](NC(=O)[C@H](C)N)C(=O)N[C@@H](Cc2ccccc2)C(=O)N2Cc3[nH]c4ccccc4c3C[C@@H]2C(=O)N[C@@H](CCCCN)C(=O)N[C@@H](Cc2ccc(O)cc2)C(=O)N1)C(O)=O