Reaction Details
TargetInsulin-like growth factor 1 receptor
LigandBDBM50445472
Substrate/Competitorn/a
Meas. Tech.ChEMBL_1284302 (CHEMBL3108323)
IC50 2040±n/a nM
Citation El Amrani, MLai, DDebbab, AAly, AHSiems, KSeidel, CSchnekenburger, MGaigneaux, ADiederich, MFeger, DLin, WProksch, P Protein kinase and HDAC inhibitors from the endophytic fungus Epicoccum nigrum. J Nat Prod77:49-56 (2014) 
 
Insulin-like growth factor 1 receptor
Name:Insulin-like growth factor 1 receptor
Type:Protein
Mol. Mass.:154776.79
Organism:Homo sapiens (Human)
Description:P08069
Residue:1367
BDBM50445472
NameBDBM50445472
Synonyms:CHEMBL3104852
TypeSmall organic molecule
Emp. Form.C10H10O6
Mol. Mass.226.1828
SMILESCOC1OC(=O)c2c1c(C)c(O)c(O)c2O