Reaction Details
TargetAurora kinase B
LigandBDBM50445474
Substrate/Competitorn/a
Meas. Tech.ChEMBL_1284305 (CHEMBL3108326)
IC50 7290±n/a nM
Citation El Amrani, MLai, DDebbab, AAly, AHSiems, KSeidel, CSchnekenburger, MGaigneaux, ADiederich, MFeger, DLin, WProksch, P Protein kinase and HDAC inhibitors from the endophytic fungus Epicoccum nigrum. J Nat Prod77:49-56 (2014) 
 
Aurora kinase B
Name:Aurora kinase B
Type:Protein
Mol. Mass.:39327.72
Organism:Homo sapiens (Human)
Description:Q96GD4
Residue:344
BDBM50445474
NameBDBM50445474
Synonyms:CHEMBL3104855
TypeSmall organic molecule
Emp. Form.C18H14O8
Mol. Mass.358.299
SMILESCc1c(O)c(O)c2oc(cc2c1C=O)-c1c(C)c(O)c(O)c(O)c1C=O