Reaction Details
TargetNUAK family SNF1-like kinase 1
LigandBDBM50445471
Substrate/Competitorn/a
Meas. Tech.ChEMBL_1284307 (CHEMBL3108328)
IC50>30000±n/a nM
Citation El Amrani, MLai, DDebbab, AAly, AHSiems, KSeidel, CSchnekenburger, MGaigneaux, ADiederich, MFeger, DLin, WProksch, P Protein kinase and HDAC inhibitors from the endophytic fungus Epicoccum nigrum. J Nat Prod77:49-56 (2014) 
 
NUAK family SNF1-like kinase 1
Name:NUAK family SNF1-like kinase 1
Type:PROTEIN
Mol. Mass.:74326.51
Organism:Homo sapiens (Human)
Description:ChEMBL_1451343
Residue:661
BDBM50445471
NameBDBM50445471
Synonyms:CHEMBL3104853
TypeSmall organic molecule
Emp. Form.C10H12O5
Mol. Mass.212.1993
SMILESCOCc1c(C)c(O)c(O)c(O)c1C=O